Home

Indiferencia cohete Incomparable error command failed gradlew bat app installdebug proposición lecho Inicialmente

Could not Compile Settings File project/android/settings.gradle
Could not Compile Settings File project/android/settings.gradle

gradle - React Native example (UIExplorer) building issue - Stack Overflow
gradle - React Native example (UIExplorer) building issue - Stack Overflow

Command Failed: gradlew.bat installDebug error whenever installing  dependencies like navigation, firebase, icons etc in React-Native - Stack  Overflow
Command Failed: gradlew.bat installDebug error whenever installing dependencies like navigation, firebase, icons etc in React-Native - Stack Overflow

javascript - Error: Command failed: gradlew.bat app:installDebug  -PreactNativeDevServerPort=8081 Failed to launch emulator. Reason: No  emulators found - Stack Overflow
javascript - Error: Command failed: gradlew.bat app:installDebug -PreactNativeDevServerPort=8081 Failed to launch emulator. Reason: No emulators found - Stack Overflow

Android) Build fails with "Cannot get property 'mavenRepo'" - Jitsi  Community Forum - developers & users
Android) Build fails with "Cannot get property 'mavenRepo'" - Jitsi Community Forum - developers & users

A problem occurred configuring project app in react native | SKPTRICKS
A problem occurred configuring project app in react native | SKPTRICKS

Command failed: gradlew.bat installDebug_I_have_to_believe的博客-CSDN博客
Command failed: gradlew.bat installDebug_I_have_to_believe的博客-CSDN博客

Problems tryint to install react native with android in windows 10 :  r/reactnative
Problems tryint to install react native with android in windows 10 : r/reactnative

Pin on Web Pixer
Pin on Web Pixer

when i run react-native run-android · Issue #23516 · facebook/react-native  · GitHub
when i run react-native run-android · Issue #23516 · facebook/react-native · GitHub

React-native Command failed: gradlew.bat app:installDebug  -PreactNativeDevServerPort=8081 - Stack Overflow
React-native Command failed: gradlew.bat app:installDebug -PreactNativeDevServerPort=8081 - Stack Overflow

Erro ao executar npx react-native run-android | React Native: utilizando e  criando Hooks | Alura - Cursos online de tecnologia
Erro ao executar npx react-native run-android | React Native: utilizando e criando Hooks | Alura - Cursos online de tecnologia

Learn How to Create First React-Native Application | getKT
Learn How to Create First React-Native Application | getKT

Command failed : gradlew.bat app:installDebug. when run react-native  run-android · Issue #300 · infinitered/ignite-andross · GitHub
Command failed : gradlew.bat app:installDebug. when run react-native run-android · Issue #300 · infinitered/ignite-andross · GitHub

javascript - 运行react-native run-android 出现以下错误,应该怎么解决- SegmentFault 思否
javascript - 运行react-native run-android 出现以下错误,应该怎么解决- SegmentFault 思否

error message : Task :app:installDebug FAILED | React Native | Fixed |  Hindi - YouTube
error message : Task :app:installDebug FAILED | React Native | Fixed | Hindi - YouTube

خطا در اجرای دستور react-native run-android
خطا در اجرای دستور react-native run-android

Command failed : gradlew.bat app:installDebug. when run react-native  run-android · Issue #300 · infinitered/ignite-andross · GitHub
Command failed : gradlew.bat app:installDebug. when run react-native run-android · Issue #300 · infinitered/ignite-andross · GitHub

React Native Errors - Failed to install and Unable to load script,  Solved!!! - YouTube
React Native Errors - Failed to install and Unable to load script, Solved!!! - YouTube

Command failed : gradlew.bat app:installDebug. when run react-native  run-android · Issue #300 · infinitered/ignite-andross · GitHub
Command failed : gradlew.bat app:installDebug. when run react-native run-android · Issue #300 · infinitered/ignite-andross · GitHub

android - react-native :app:installDebug FAILED - Stack Overflow
android - react-native :app:installDebug FAILED - Stack Overflow

mergeLibDexDebug.. - 인프런 | 질문 & 답변
mergeLibDexDebug.. - 인프런 | 질문 & 답변

error message : Task :app:installDebug FAILED | React Native | Fixed |  Hindi - YouTube
error message : Task :app:installDebug FAILED | React Native | Fixed | Hindi - YouTube

React Native Command failed: gradlew.bat installDebug (Solved)
React Native Command failed: gradlew.bat installDebug (Solved)

Erro ao dar o comando react-native run-android | React Native: Trabalhando  com Function components | Alura - Cursos online de tecnologia
Erro ao dar o comando react-native run-android | React Native: Trabalhando com Function components | Alura - Cursos online de tecnologia